BDBM50293006 2-amino-4-(2,3-dimethoxyphenyl)-5-oxo-7-phenyl-5,6,7,8-tetrahydro-4H-chromene-3-carbonitrile::CHEMBL460700
SMILES COc1cccc(C2C(C#N)C(=N)OC3=C2C(=O)CC(C3)c2ccccc2)c1OC
InChI Key InChIKey=KXWMABLGFVTSAK-UHFFFAOYSA-N
Data  3 IC50
  Tab Delimited (TSV)   2D SDfile   Computed 3D by Vconf -m prep SDfile
Find this compound or compounds like it in BindingDB:
Activity Spreadsheet -- Enzyme Inhibition Constant Data from BindingDB
Found 1 hit for monomerid = 50293006
TargetExcitatory amino acid transporter 3(Homo sapiens (Human))
University Of Copenhagen
Curated by ChEMBL
LigandPNGBDBM50293006(2-amino-4-(2,3-dimethoxyphenyl)-5-oxo-7-phenyl-5,6...)
Affinity DataIC50: >1.00E+5nM. Assay description: Displacement of [3H]D-Asp from human EAAT3 receptor expressed in HEK293 cells
In DepthDetails ArticlePubMed